Reaction Details
TargetGag-Pol polyprotein [489-587]
LigandBDBM50121507
Substrate/Competitorn/a
Meas. Tech.ChEMBL_158026 (CHEMBL768619)
Ki 0.054000±n/a nM
Kd 4.42±n/a nM
KON 5970000 M-1s-1
Citation Markgren, POSchaal, WHämäläinen, MKarlén, AHallberg, ASamuelsson, BDanielson, UH Relationships between structure and interaction kinetics for HIV-1 protease inhibitors. J Med Chem45:5430-9 (2002) Gag-Pol polyprotein [489-587]
Name:Gag-Pol polyprotein [489-587]
Type:Enzyme Subunit
Mol. Mass.:10781.16
Organism:Human immunodeficiency virus type 1
Description:P04585[489-587]
Residue:99
BDBM50121507
NameBDBM50121507
Synonyms:2-{[2,5-Bis-benzyloxy-3,4-dihydroxy-5-(2-hydroxy-indan-1-ylcarbamoyl)-pentanoyl]-methyl-amino}-3-methyl-butyric acid | CHEMBL358008
TypeSmall organic molecule
Emp. Form.C35H42N2O9
Mol. Mass.634.716
SMILESCC(C)C(N(C)C(=O)[C@H](OCc1ccccc1)[C@H](O)[C@@H](O)[C@@H](OCc1ccccc1)C(=O)NC1[C@@H](O)Cc2ccccc12)C(O)=O