Reaction Details
TargetGag-Pol polyprotein [489-587]
LigandBDBM854
Substrate/Competitorn/a
Meas. Tech.ChEMBL_158026 (CHEMBL768619)
Ki 0.090000±n/a nM
Kd 1.95±n/a nM
KON 204000 M-1s-1
Citation Markgren, POSchaal, WHämäläinen, MKarlén, AHallberg, ASamuelsson, BDanielson, UH Relationships between structure and interaction kinetics for HIV-1 protease inhibitors. J Med Chem45:5430-9 (2002) Gag-Pol polyprotein [489-587]
Name:Gag-Pol polyprotein [489-587]
Type:Enzyme Subunit
Mol. Mass.:10781.16
Organism:Human immunodeficiency virus type 1
Description:P04585[489-587]
Residue:99
BDBM854
NameBDBM854
Synonyms:C2-Symmetric inhibitor 12 N1,N6-Bis[(1S)-2-methyl-1-(methylcarbamoyl)propyl]-(2R,3R,4R,5R)-2,5-bis{4-[(E)-2-methoxycarbonylethenyl]-benzyloxy}-3,4-dihydroxyhexanediamide
TypeSmall organic molecule
Emp. Form.C40H54N4O12
Mol. Mass.782.8764
SMILESCNC(=O)[C@@H](NC(=O)[C@H](OCc1ccc(\C=C\C(=O)OC)cc1)[C@H](O)[C@@H](O)[C@@H](OCc1ccc(\C=C\C(=O)OC)cc1)C(=O)N[C@@H](C(C)C)C(=O)NC)C(C)C