Reaction Details
TargetMu-type opioid receptor
LigandBDBM50108919
Substrate/Competitorn/a
Meas. Tech.ChEMBL_148993 (CHEMBL757977)
Ki 5.49±n/a nM
Citation Balboni, GSalvadori, SGuerrini, RNegri, LGiannini, EJinsmaa, YBryant, SDLazarus, LH Potent delta-opioid receptor agonists containing the Dmt-Tic pharmacophore. J Med Chem45:5556-63 (2002) Mu-type opioid receptor
Name:Mu-type opioid receptor
Type:G Protein-Coupled Receptor (GPCR)
Mol. Mass.:44503.11
Organism:Rattus norvegicus (rat)
Description:Competition binding assays were carried out using membrane preparations from transfected HN9.10 cells that constitutively expressed the mu opioid receptor.
Residue:398
BDBM50108919
NameBDBM50108919
Synonyms:2-[2-Amino-3-(4-hydroxy-2,6-dimethyl-phenyl)-propionyl]-1,2,3,4-tetrahydro-isoquinoline-3-carboxylic acid [2-(1H-benzoimidazol-2-yl)-ethyl]-amide
TypeSmall organic molecule
Emp. Form.C30H33N5O3
Mol. Mass.511.6147
SMILESCc1cc(O)cc(C)c1C[C@H](N)C(=O)N1Cc2ccccc2CC1C(=O)NCCc1nc2ccccc2[nH]1