Reaction Details
TargetMu-type opioid receptor
LigandBDBM50108918
Substrate/Competitorn/a
Meas. Tech.ChEMBL_70854 (CHEMBL680354)
IC50>10000±n/a nM
Citation Balboni, GSalvadori, SGuerrini, RNegri, LGiannini, EJinsmaa, YBryant, SDLazarus, LH Potent delta-opioid receptor agonists containing the Dmt-Tic pharmacophore. J Med Chem45:5556-63 (2002) Mu-type opioid receptor
Name:Mu-type opioid receptor
Type:Enzyme Catalytic Domain
Mol. Mass.:11165.58
Organism:GUINEA PIG
Description:P97266
Residue:98
BDBM50108918
NameBDBM50108918
Synonyms:(2S)-2-({2-[(2S)-2-amino-3-(4-hydroxy-2,6-dimethylphenyl)propanoyl]-1,2,3,4-tetrahydroisoquinolin-3-yl}formamido)propanamide | 2-[2-Amino-3-(4-hydroxy-2,6-dimethyl-phenyl)-propionyl]-1,2,3,4-tetrahydro-isoquinoline-3-carboxylic acid (1-carbamoyl-ethyl)-amide
TypeSmall organic molecule
Emp. Form.C24H30N4O4
Mol. Mass.438.5194
SMILESC[C@H](NC(=O)C1Cc2ccccc2CN1C(=O)[C@@H](N)Cc1c(C)cc(O)cc1C)C(N)=O