Reaction Details
TargetMu-type opioid receptor
LigandBDBM50121649
Substrate/Competitorn/a
Meas. Tech.ChEMBL_148993 (CHEMBL757977)
Ki 6.92±n/a nM
Citation Balboni, GSalvadori, SGuerrini, RNegri, LGiannini, EJinsmaa, YBryant, SDLazarus, LH Potent delta-opioid receptor agonists containing the Dmt-Tic pharmacophore. J Med Chem45:5556-63 (2002) Mu-type opioid receptor
Name:Mu-type opioid receptor
Type:G Protein-Coupled Receptor (GPCR)
Mol. Mass.:44503.11
Organism:Rattus norvegicus (rat)
Description:Competition binding assays were carried out using membrane preparations from transfected HN9.10 cells that constitutively expressed the mu opioid receptor.
Residue:398
BDBM50121649
NameBDBM50121649
Synonyms:2-[({2-[2-Amino-3-(4-hydroxy-2,6-dimethyl-phenyl)-propionyl]-1,2,3,4-tetrahydro-isoquinoline-3-carbonyl}-amino)-methyl]-benzoimidazole-1-carboxylic acid
TypeSmall organic molecule
Emp. Form.C30H31N5O5
Mol. Mass.541.5976
SMILESCc1cc(O)cc(C)c1C[C@H](N)C(=O)N1Cc2ccccc2CC1C(=O)NCc1nc2ccccc2n1C(O)=O