Reaction Details
TargetAngiopoietin-1 receptor
LigandBDBM21
Substrate/Competitorn/a
Meas. Tech.ChEMBL_210886 (CHEMBL814618)
IC50 567±n/a nM
Citation Manley, PWFuret, PBold, GBrüggen, JMestan, JMeyer, TSchnell, CRWood, JHaberey, MHuth, AKrüger, MMenrad, AOttow, ESeidelmann, DSiemeister, GThierauch, KH Anthranilic acid amides: a novel class of antiangiogenic VEGF receptor kinase inhibitors. J Med Chem45:5687-93 (2002) Angiopoietin-1 receptor
Name:Angiopoietin-1 receptor
Type:Enzyme
Mol. Mass.:125835.70
Organism:Homo sapiens (Human)
Description:Q02763
Residue:1124
BDBM21
NameBDBM21
Synonyms:CHEMBL24828 VANDETANIB ZD6474 | cid_3081361
Typen/a
Emp. Form.C22H24BrFN4O2
Mol. Mass.475.354
SMILESCOc1cc2c(Nc3ccc(Br)cc3F)ncnc2cc1OCC1CCN(C)CC1