Reaction Details
TargetCyclin-dependent kinase 1
LigandBDBM9503
Substrate/Competitorn/a
Meas. Tech.ChEMBL_50321 (CHEMBL660790)
IC50>10000±n/a nM
Citation Manley, PWFuret, PBold, GBrüggen, JMestan, JMeyer, TSchnell, CRWood, JHaberey, MHuth, AKrüger, MMenrad, AOttow, ESeidelmann, DSiemeister, GThierauch, KH Anthranilic acid amides: a novel class of antiangiogenic VEGF receptor kinase inhibitors. J Med Chem45:5687-93 (2002) Cyclin-dependent kinase 1
Name:Cyclin-dependent kinase 1
Type:Enzyme Subunit
Mol. Mass.:34101.08
Organism:Homo sapiens (Human)
Description:P06493
Residue:297
BDBM9503
NameBDBM9503
Synonyms:2-[(pyridin-4-ylmethyl)amino]-N-[3-(trifluoromethyl)phenyl]benzamide anthranyl amide derivative C
TypeSmall organic molecule
Emp. Form.C20H16F3N3O
Mol. Mass.371.3557
SMILESFC(F)(F)c1cccc(NC(=O)c2ccccc2NCc2ccncc2)c1