Reaction Details
TargetVascular endothelial growth factor receptor 3
LigandBDBM9503
Substrate/Competitorn/a
Meas. Tech.ChEMBL_214249 (CHEMBL820848)
IC50 18±n/a nM
Citation Manley, PWFuret, PBold, GBrüggen, JMestan, JMeyer, TSchnell, CRWood, JHaberey, MHuth, AKrüger, MMenrad, AOttow, ESeidelmann, DSiemeister, GThierauch, KH Anthranilic acid amides: a novel class of antiangiogenic VEGF receptor kinase inhibitors. J Med Chem45:5687-93 (2002) Vascular endothelial growth factor receptor 3
Name:Vascular endothelial growth factor receptor 3
Type:Protein
Mol. Mass.:152749.58
Organism:Homo sapiens (Human)
Description:P35916-2
Residue:1363
BDBM9503
NameBDBM9503
Synonyms:2-[(pyridin-4-ylmethyl)amino]-N-[3-(trifluoromethyl)phenyl]benzamide anthranyl amide derivative C
TypeSmall organic molecule
Emp. Form.C20H16F3N3O
Mol. Mass.371.3557
SMILESFC(F)(F)c1cccc(NC(=O)c2ccccc2NCc2ccncc2)c1