Reaction Details
TargetInsulin-like growth factor 1 receptor
LigandBDBM50121980
Substrate/Competitorn/a
Meas. Tech.ChEMBL_90284 (CHEMBL697349)
IC50 64000±n/a nM
Citation Manley, PWFuret, PBold, GBrüggen, JMestan, JMeyer, TSchnell, CRWood, JHaberey, MHuth, AKrüger, MMenrad, AOttow, ESeidelmann, DSiemeister, GThierauch, KH Anthranilic acid amides: a novel class of antiangiogenic VEGF receptor kinase inhibitors. J Med Chem45:5687-93 (2002) Insulin-like growth factor 1 receptor
Name:Insulin-like growth factor 1 receptor
Type:Protein
Mol. Mass.:154776.79
Organism:Homo sapiens (Human)
Description:P08069
Residue:1367
BDBM50121980
NameBDBM50121980
Synonyms:CHEMBL347537 | N-(3-Isoquinolin-4-yl-phenyl)-2-[(pyridin-4-ylmethyl)-amino]-benzamide
TypeSmall organic molecule
Emp. Form.C28H22N4O
Mol. Mass.430.5005
SMILESO=C(Nc1cccc(c1)-c1cncc2ccccc12)c1ccccc1NCc1ccncc1