Reaction Details
TargetEpidermal growth factor receptor
LigandBDBM9503
Substrate/Competitorn/a
Meas. Tech.ChEMBL_67043 (CHEMBL677881)
IC50 10400±n/a nM
Citation Manley, PWFuret, PBold, GBrüggen, JMestan, JMeyer, TSchnell, CRWood, JHaberey, MHuth, AKrüger, MMenrad, AOttow, ESeidelmann, DSiemeister, GThierauch, KH Anthranilic acid amides: a novel class of antiangiogenic VEGF receptor kinase inhibitors. J Med Chem45:5687-93 (2002) Epidermal growth factor receptor
Name:Epidermal growth factor receptor
Type:Receptor Kinase Domain
Mol. Mass.:134279.59
Organism:Homo sapiens (Human)
Description:P00533
Residue:1210
BDBM9503
NameBDBM9503
Synonyms:2-[(pyridin-4-ylmethyl)amino]-N-[3-(trifluoromethyl)phenyl]benzamide anthranyl amide derivative C
TypeSmall organic molecule
Emp. Form.C20H16F3N3O
Mol. Mass.371.3557
SMILESFC(F)(F)c1cccc(NC(=O)c2ccccc2NCc2ccncc2)c1