Reaction Details
TargetD(4) dopamine receptor
LigandBDBM50122032
Substrate/Competitorn/a
Meas. Tech.ChEMBL_60680 (CHEMBL675942)
Ki 0.21±n/a nM
Citation Leopoldo, MBerardi, FColabufo, NADe Giorgio, PLacivita, EPerrone, RTortorella, V Structure-affinity relationship study on N-[4-(4-arylpiperazin-1-yl)butyl]arylcarboxamides as potent and selective dopamine D(3) receptor ligands. J Med Chem45:5727-35 (2002) D(4) dopamine receptor
Name:D(4) dopamine receptor
Type:Enzyme
Mol. Mass.:48373.19
Organism:Homo sapiens (Human)
Description:P21917
Residue:419
BDBM50122032
NameBDBM50122032
Synonyms:3-Methoxy-N-[2-(4-naphthalen-1-yl-piperazin-1-yl)-ethyl]-benzamide | CHEMBL345848
TypeSmall organic molecule
Emp. Form.C24H27N3O2
Mol. Mass.389.4901
SMILESCOc1cccc(c1)C(=O)NCCN1CCN(CC1)c1cccc2ccccc12