Reaction Details
TargetMelanocyte-stimulating hormone receptor
LigandBDBM50122066
Substrate/Competitorn/a
Meas. Tech.ChEMBL_106823 (CHEMBL717664)
EC50 17.9±n/a nM
Citation Holder, JRXiang, ZBauzo, RMHaskell-Luevano, C Structure-activity relationships of the melanocortin tetrapeptide Ac-His-D-Phe-Arg-Trp-NH2 at the mouse melanocortin receptors. 4. Modifications at the Trp position. J Med Chem45:5736-44 (2002) Melanocyte-stimulating hormone receptor
Name:Melanocyte-stimulating hormone receptor
Type:PROTEIN
Mol. Mass.:35238.60
Organism:Mus musculus
Description:ChEMBL_1498846
Residue:315
BDBM50122066
NameBDBM50122066
Synonyms:Ac-His-D-Phe-Arg-Nal(2')-NH2 | CHEMBL357558
TypeSmall organic molecule
Emp. Form.C36H44N10O5
Mol. Mass.696.7986
SMILESCC(=O)N[C@@H](Cc1cnc[nH]1)C(=O)N[C@@H](Cc1ccccc1)C(=O)N[C@@H](CCCNC(N)=N)C(=O)N[C@H](Cc1ccc2ccccc2c1)C(N)=O