Reaction Details
TargetMelanocortin receptor 5
LigandBDBM50122067
Substrate/Competitorn/a
Meas. Tech.ChEMBL_104262 (CHEMBL711699)
EC50 750±n/a nM
Citation Holder, JRXiang, ZBauzo, RMHaskell-Luevano, C Structure-activity relationships of the melanocortin tetrapeptide Ac-His-D-Phe-Arg-Trp-NH2 at the mouse melanocortin receptors. 4. Modifications at the Trp position. J Med Chem45:5736-44 (2002) Melanocortin receptor 5
Name:Melanocortin receptor 5
Type:Enzyme
Mol. Mass.:36966.58
Organism:Mus musculus (Mouse)
Description:P41149
Residue:325
BDBM50122067
NameBDBM50122067
Synonyms:Ac-His-D-Phe-Arg-D-Nal(1')-NH2 | CHEMBL346925
TypeSmall organic molecule
Emp. Form.C36H44N10O5
Mol. Mass.696.7986
SMILESCC(=O)N[C@@H](Cc1cnc[nH]1)C(=O)N[C@@H](Cc1ccccc1)C(=O)N[C@@H](CCCNC(N)=N)C(=O)N[C@@H](Cc1cccc2ccccc12)C(N)=O