Reaction Details
TargetInosine-5'-monophosphate dehydrogenase 1
LigandBDBM19264
Substrate/Competitorn/a
Meas. Tech.ChEMBL_89798 (CHEMBL698516)
Ki 40±n/a nM
Citation Pankiewicz, KWLesiak-Watanabe, KBWatanabe, KAPatterson, SEJayaram, HNYalowitz, JAMiller, MDSeidman, MMajumdar, APrehna, GGoldstein, BM Novel mycophenolic adenine bis(phosphonate) analogues as potential differentiation agents against human leukemia. J Med Chem45:703-12 (2002) Inosine-5'-monophosphate dehydrogenase 1
Name:Inosine-5'-monophosphate dehydrogenase 1
Type:Enzyme
Mol. Mass.:55407.70
Organism:Homo sapiens (Human)
Description:Recombinant IMPDH1 expressed in E. coli.
Residue:514
BDBM19264
NameBDBM19264
Synonyms:(4E)-6-(4-hydroxy-6-methoxy-7-methyl-3-oxo-1,3-dihydro-2-benzofuran-5-yl)-4-methylhex-4-enoic acid CHEMBL866 Mycophenolic Acid (MPA) | Myfortic
TypeSmall organic molecule
Emp. Form.C17H20O6
Mol. Mass.320.3371
SMILESCOc1c(C)c2COC(=O)c2c(O)c1C\C=C(/C)CCC(O)=O