Reaction Details
TargetDelta-type opioid receptor
LigandBDBM50108918
Substrate/Competitorn/a
Meas. Tech.ChEMBL_146919 (CHEMBL757507)
Ki 0.22±n/a nM
Citation Balboni, GGuerrini, RSalvadori, SBianchi, CRizzi, DBryant, SDLazarus, LH Evaluation of the Dmt-Tic pharmacophore: conversion of a potent delta-opioid receptor antagonist into a potent delta agonist and ligands with mixed properties. J Med Chem45:713-20 (2002) Delta-type opioid receptor
Name:Delta-type opioid receptor
Type:G Protein-Coupled Receptor (GPCR)
Mol. Mass.:40465.04
Organism:Rattus norvegicus (rat)
Description:Competition binding assays were using CHO-K1 cell membranes expressing the opioid receptor.
Residue:372
BDBM50108918
NameBDBM50108918
Synonyms:(2S)-2-({2-[(2S)-2-amino-3-(4-hydroxy-2,6-dimethylphenyl)propanoyl]-1,2,3,4-tetrahydroisoquinolin-3-yl}formamido)propanamide | 2-[2-Amino-3-(4-hydroxy-2,6-dimethyl-phenyl)-propionyl]-1,2,3,4-tetrahydro-isoquinoline-3-carboxylic acid (1-carbamoyl-ethyl)-amide
TypeSmall organic molecule
Emp. Form.C24H30N4O4
Mol. Mass.438.5194
SMILESC[C@H](NC(=O)C1Cc2ccccc2CN1C(=O)[C@@H](N)Cc1c(C)cc(O)cc1C)C(N)=O