Reaction Details
TargetDisintegrin and metalloproteinase domain-containing protein 9
LigandBDBM50109622
Substrate/Competitorn/a
Meas. Tech.ChEMBL_63593 (CHEMBL675240)
IC50 1340±n/a nM
Citation Sawa, MKiyoi, TKurokawa, KKumihara, HYamamoto, MMiyasaka, TIto, YHirayama, RInoue, TKirii, YNishiwaki, EOhmoto, HMaeda, YIshibushi, EInoue, YYoshino, KKondo, H New type of metalloproteinase inhibitor: design and synthesis of new phosphonamide-based hydroxamic acids. J Med Chem45:919-29 (2002) Disintegrin and metalloproteinase domain-containing protein 9
Name:Disintegrin and metalloproteinase domain-containing protein 9
Type:Enzyme
Mol. Mass.:90567.68
Organism:Homo sapiens (Human)
Description:Q13443
Residue:819
BDBM50109622
NameBDBM50109622
Synonyms:(3-Hydroxycarbamoyl-3,4-dihydro-1H-isoquinolin-2-yl)-(4-methoxy-phenyl)-phosphinic acid cyclohexylmethyl ester | CHEMBL173846
TypeSmall organic molecule
Emp. Form.C24H31N2O5P
Mol. Mass.458.4871
SMILESCOc1ccc(cc1)P(=O)(OCC1CCCCC1)N1Cc2ccccc2CC1C(=O)NO