Reaction Details
TargetInterstitial collagenase
LigandBDBM50109633
Substrate/Competitorn/a
Meas. Tech.ChEMBL_106139 (CHEMBL718686)
Ki 2.02±n/a nM
Citation Sawa, MKiyoi, TKurokawa, KKumihara, HYamamoto, MMiyasaka, TIto, YHirayama, RInoue, TKirii, YNishiwaki, EOhmoto, HMaeda, YIshibushi, EInoue, YYoshino, KKondo, H New type of metalloproteinase inhibitor: design and synthesis of new phosphonamide-based hydroxamic acids. J Med Chem45:919-29 (2002) Interstitial collagenase
Name:Interstitial collagenase
Type:Enzyme
Mol. Mass.:54010.26
Organism:Homo sapiens (Human)
Description: P03956
Residue:469
BDBM50109633
NameBDBM50109633
Synonyms:(3-Hydroxycarbamoyl-1,3,4,9-tetrahydro-beta-carbolin-2-yl)-(4-methoxy-phenyl)-phosphinic acid ethyl ester | CHEMBL172249
TypeSmall organic molecule
Emp. Form.C21H24N3O5P
Mol. Mass.429.4061
SMILESCCOP(=O)(N1Cc2[nH]c3ccccc3c2CC1C(=O)NO)c1ccc(OC)cc1