Reaction Details
TargetMatrix metalloproteinase-9
LigandBDBM50109621
Substrate/Competitorn/a
Meas. Tech.ChEMBL_105387 (CHEMBL710806)
Ki 0.1±n/a nM
Citation Sawa, MKiyoi, TKurokawa, KKumihara, HYamamoto, MMiyasaka, TIto, YHirayama, RInoue, TKirii, YNishiwaki, EOhmoto, HMaeda, YIshibushi, EInoue, YYoshino, KKondo, H New type of metalloproteinase inhibitor: design and synthesis of new phosphonamide-based hydroxamic acids. J Med Chem45:919-29 (2002) Matrix metalloproteinase-9
Name:Matrix metalloproteinase-9
Type:Enzyme
Mol. Mass.:78452.28
Organism:Homo sapiens (Human)
Description:P14780
Residue:707
BDBM50109621
NameBDBM50109621
Synonyms:CHEMBL425316 | [4-(4-Amino-phenoxy)-phenyl]-(3-hydroxycarbamoyl-3,4-dihydro-1H-isoquinolin-2-yl)-phosphinic acid ethyl ester
TypeSmall organic molecule
Emp. Form.C24H26N3O5P
Mol. Mass.467.4541
SMILESCCOP(=O)(N1Cc2ccccc2CC1C(=O)NO)c1ccc(Oc2ccc(N)cc2)cc1