Reaction Details
TargetDisintegrin and metalloproteinase domain-containing protein 9
LigandBDBM50109638
Substrate/Competitorn/a
Meas. Tech.ChEMBL_63593 (CHEMBL675240)
IC50 2600±n/a nM
Citation Sawa, MKiyoi, TKurokawa, KKumihara, HYamamoto, MMiyasaka, TIto, YHirayama, RInoue, TKirii, YNishiwaki, EOhmoto, HMaeda, YIshibushi, EInoue, YYoshino, KKondo, H New type of metalloproteinase inhibitor: design and synthesis of new phosphonamide-based hydroxamic acids. J Med Chem45:919-29 (2002) Disintegrin and metalloproteinase domain-containing protein 9
Name:Disintegrin and metalloproteinase domain-containing protein 9
Type:Enzyme
Mol. Mass.:90567.68
Organism:Homo sapiens (Human)
Description:Q13443
Residue:819
BDBM50109638
NameBDBM50109638
Synonyms:(3-Hydroxycarbamoyl-3,4-dihydro-1H-isoquinolin-2-yl)-pyridin-4-yl-phosphinic acid ethyl ester | CHEMBL171986
TypeSmall organic molecule
Emp. Form.C17H20N3O4P
Mol. Mass.361.3322
SMILESCCOP(=O)(N1Cc2ccccc2CC1C(=O)NO)c1ccncc1