Reaction Details
TargetDisintegrin and metalloproteinase domain-containing protein 9
LigandBDBM50109634
Substrate/Competitorn/a
Meas. Tech.ChEMBL_63593 (CHEMBL675240)
IC50 510±n/a nM
Citation Sawa, MKiyoi, TKurokawa, KKumihara, HYamamoto, MMiyasaka, TIto, YHirayama, RInoue, TKirii, YNishiwaki, EOhmoto, HMaeda, YIshibushi, EInoue, YYoshino, KKondo, H New type of metalloproteinase inhibitor: design and synthesis of new phosphonamide-based hydroxamic acids. J Med Chem45:919-29 (2002) Disintegrin and metalloproteinase domain-containing protein 9
Name:Disintegrin and metalloproteinase domain-containing protein 9
Type:Enzyme
Mol. Mass.:90567.68
Organism:Homo sapiens (Human)
Description:Q13443
Residue:819
BDBM50109634
NameBDBM50109634
Synonyms:(3-Hydroxycarbamoyl-3,4-dihydro-1H-isoquinolin-2-yl)-(4-methoxy-phenyl)-phosphinic acid 2-ethoxy-ethyl ester | CHEMBL368857
TypeSmall organic molecule
Emp. Form.C21H27N2O6P
Mol. Mass.434.4226
SMILESCCOCCOP(=O)(N1Cc2ccccc2CC1C(=O)NO)c1ccc(OC)cc1