Reaction Details
TargetMatrix metalloproteinase-9
LigandBDBM50109637
Substrate/Competitorn/a
Meas. Tech.ChEMBL_105387 (CHEMBL710806)
Ki 5.2±n/a nM
Citation Sawa, MKiyoi, TKurokawa, KKumihara, HYamamoto, MMiyasaka, TIto, YHirayama, RInoue, TKirii, YNishiwaki, EOhmoto, HMaeda, YIshibushi, EInoue, YYoshino, KKondo, H New type of metalloproteinase inhibitor: design and synthesis of new phosphonamide-based hydroxamic acids. J Med Chem45:919-29 (2002) Matrix metalloproteinase-9
Name:Matrix metalloproteinase-9
Type:Enzyme
Mol. Mass.:78452.28
Organism:Homo sapiens (Human)
Description:P14780
Residue:707
BDBM50109637
NameBDBM50109637
Synonyms:4-[Ethoxy-(4-methoxy-phenyl)-phosphinoyl]-3-hydroxycarbamoyl-piperazine-1-carboxylic acid benzyl ester | CHEMBL173235
TypeSmall organic molecule
Emp. Form.C22H28N3O7P
Mol. Mass.477.4474
SMILESCCOP(=O)(N1CCN(CC1C(=O)NO)C(=O)OCc1ccccc1)c1ccc(OC)cc1