Reaction Details
TargetDisintegrin and metalloproteinase domain-containing protein 9
LigandBDBM50109640
Substrate/Competitorn/a
Meas. Tech.ChEMBL_63593 (CHEMBL675240)
IC50 890±n/a nM
Citation Sawa, MKiyoi, TKurokawa, KKumihara, HYamamoto, MMiyasaka, TIto, YHirayama, RInoue, TKirii, YNishiwaki, EOhmoto, HMaeda, YIshibushi, EInoue, YYoshino, KKondo, H New type of metalloproteinase inhibitor: design and synthesis of new phosphonamide-based hydroxamic acids. J Med Chem45:919-29 (2002) Disintegrin and metalloproteinase domain-containing protein 9
Name:Disintegrin and metalloproteinase domain-containing protein 9
Type:Enzyme
Mol. Mass.:90567.68
Organism:Homo sapiens (Human)
Description:Q13443
Residue:819
BDBM50109640
NameBDBM50109640
Synonyms:(3-Hydroxycarbamoyl-3,4-dihydro-1H-isoquinolin-2-yl)-thiophen-2-yl-phosphinic acid ethyl ester | CHEMBL367710
TypeSmall organic molecule
Emp. Form.C16H19N2O4PS
Mol. Mass.366.372
SMILESCCOP(=O)(N1Cc2ccccc2CC1C(=O)NO)c1cccs1