Reaction Details
TargetDisintegrin and metalloproteinase domain-containing protein 9
LigandBDBM50109637
Substrate/Competitorn/a
Meas. Tech.ChEMBL_63593 (CHEMBL675240)
IC50 430±n/a nM
Citation Sawa, MKiyoi, TKurokawa, KKumihara, HYamamoto, MMiyasaka, TIto, YHirayama, RInoue, TKirii, YNishiwaki, EOhmoto, HMaeda, YIshibushi, EInoue, YYoshino, KKondo, H New type of metalloproteinase inhibitor: design and synthesis of new phosphonamide-based hydroxamic acids. J Med Chem45:919-29 (2002) Disintegrin and metalloproteinase domain-containing protein 9
Name:Disintegrin and metalloproteinase domain-containing protein 9
Type:Enzyme
Mol. Mass.:90567.68
Organism:Homo sapiens (Human)
Description:Q13443
Residue:819
BDBM50109637
NameBDBM50109637
Synonyms:4-[Ethoxy-(4-methoxy-phenyl)-phosphinoyl]-3-hydroxycarbamoyl-piperazine-1-carboxylic acid benzyl ester | CHEMBL173235
TypeSmall organic molecule
Emp. Form.C22H28N3O7P
Mol. Mass.477.4474
SMILESCCOP(=O)(N1CCN(CC1C(=O)NO)C(=O)OCc1ccccc1)c1ccc(OC)cc1