Reaction Details
TargetP2X purinoceptor 1
LigandBDBM50118229
Substrate/Competitorn/a
Meas. Tech.ChEMBL_149727 (CHEMBL759510)
IC50 1150±n/a nM
Citation Raboisson, PBaurand, ACazenave, JPGachet, CRetat, MSpiess, BBourguignon, JJ Novel antagonists acting at the P2Y(1) purinergic receptor: synthesis and conformational analysis using potentiometric and nuclear magnetic resonance titration techniques. J Med Chem45:962-72 (2002) P2X purinoceptor 1
Name:P2X purinoceptor 1
Type:Enzyme Catalytic Domain
Mol. Mass.:44992.65
Organism:Homo sapiens (Human)
Description:Purinergic, P2X 0 HUMAN::P51575
Residue:399
BDBM50118229
NameBDBM50118229
Synonyms:CHEMBL129841 | MRS 2179
TypeSmall organic molecule
Emp. Form.C11H17N5O9P2
Mol. Mass.425.2283
SMILESCNc1ncnc2n(cnc12)[C@H]1C[C@H](OP(O)(O)=O)[C@@H](COP(O)(O)=O)O1