Reaction Details
TargetMuscarinic acetylcholine receptor M5
LigandBDBM50109647
Substrate/Competitorn/a
Meas. Tech.ChEMBL_139392 (CHEMBL747005)
Ki 2.3±n/a nM
Citation Sagara, YSagara, TMase, TKimura, TNumazawa, TFujikawa, TNoguchi, KOhtake, N Cyclohexylmethylpiperidinyltriphenylpropioamide: a selective muscarinic M(3) antagonist discriminating against the other receptor subtypes. J Med Chem45:984-7 (2002) Muscarinic acetylcholine receptor M5
Name:Muscarinic acetylcholine receptor M5
Type:PROTEIN
Mol. Mass.:60102.35
Organism:Homo sapiens (Human)
Description:ChEMBL_1517990
Residue:532
BDBM50109647
NameBDBM50109647
Synonyms:2-{1-[2-(2,3-Dihydro-benzofuran-5-yl)-ethyl]-pyrrolidin-3-yl}-2,2-diphenyl-acetamide (Darifenacin) DARIFENACIN Enablex
TypeSmall organic molecule
Emp. Form.C28H30N2O2
Mol. Mass.426.55
SMILESNC(=O)C([C@@H]1CCN(CCc2ccc3OCCc3c2)C1)(c1ccccc1)c1ccccc1