Reaction Details
TargetMuscarinic acetylcholine receptor M4
LigandBDBM50109650
Substrate/Competitorn/a
Meas. Tech.ChEMBL_139122 (CHEMBL749860)
Ki 60±n/a nM
Citation Sagara, YSagara, TMase, TKimura, TNumazawa, TFujikawa, TNoguchi, KOhtake, N Cyclohexylmethylpiperidinyltriphenylpropioamide: a selective muscarinic M(3) antagonist discriminating against the other receptor subtypes. J Med Chem45:984-7 (2002) Muscarinic acetylcholine receptor M4
Name:Muscarinic acetylcholine receptor M4
Type:Enzyme Catalytic Domain
Mol. Mass.:53079.31
Organism:Homo sapiens (Human)
Description:Cholinergic, muscarinic M4 CHRM4 HUMAN M3::P08173
Residue:479
BDBM50109650
NameBDBM50109650
Synonyms:CHEMBL369062 | N-{2-[(1-Cyclohexylmethyl-piperidin-3-ylmethyl)-carbamoyl]-ethyl}-4-(3,3,3-triphenyl-propionylamino)-butyramide
TypeSmall organic molecule
Emp. Form.C41H54N4O3
Mol. Mass.650.8925
SMILESO=C(CCCNC(=O)CC(c1ccccc1)(c1ccccc1)c1ccccc1)NCCC(=O)NCC1CCCN(CC2CCCCC2)C1