Reaction Details
TargetMuscarinic acetylcholine receptor M3
LigandBDBM50109650
Substrate/Competitorn/a
Meas. Tech.ChEMBL_138703 (CHEMBL747818)
Ki 2.1±n/a nM
Citation Sagara, YSagara, TMase, TKimura, TNumazawa, TFujikawa, TNoguchi, KOhtake, N Cyclohexylmethylpiperidinyltriphenylpropioamide: a selective muscarinic M(3) antagonist discriminating against the other receptor subtypes. J Med Chem45:984-7 (2002) Muscarinic acetylcholine receptor M3
Name:Muscarinic acetylcholine receptor M3
Type:Enzyme
Mol. Mass.:66151.03
Organism:Homo sapiens (Human)
Description:P20309
Residue:590
BDBM50109650
NameBDBM50109650
Synonyms:CHEMBL369062 | N-{2-[(1-Cyclohexylmethyl-piperidin-3-ylmethyl)-carbamoyl]-ethyl}-4-(3,3,3-triphenyl-propionylamino)-butyramide
TypeSmall organic molecule
Emp. Form.C41H54N4O3
Mol. Mass.650.8925
SMILESO=C(CCCNC(=O)CC(c1ccccc1)(c1ccccc1)c1ccccc1)NCCC(=O)NCC1CCCN(CC2CCCCC2)C1