Reaction Details
TargetNeuronal acetylcholine receptor subunit alpha-7
LigandBDBM50023330
Substrate/Competitorn/a
Meas. Tech.ChEMBL_144180 (CHEMBL749561)
Ki 90±n/a nM
Citation Gohlke, HGündisch, DSchwarz, SSeitz, GTilotta, MCWegge, T Synthesis and nicotinic binding studies on enantiopure diazine analogues of the novel (2-chloro-5-pyridyl)-9-azabicyclo[4.2.1]non-2-ene UB-165. J Med Chem45:1064-72 (2002) Neuronal acetylcholine receptor subunit alpha-7
Name:Neuronal acetylcholine receptor subunit alpha-7
Type:Enzyme
Mol. Mass.:56502.44
Organism:Rattus norvegicus (Rat)
Description:Q05941
Residue:502
BDBM50023330
NameBDBM50023330
Synonyms:1-(9-Aza-bicyclo[4.2.1]non-2-en-2-yl)-ethanone Anatoxin-A,(+) CHEMBL25619
TypeSmall organic molecule
Emp. Form.C10H15NO
Mol. Mass.165.2322
SMILESCC(=O)C1=CCCC2CCC1N2