Reaction Details
TargetNeuronal acetylcholine receptor subunit alpha-7
LigandBDBM50110263
Substrate/Competitorn/a
Meas. Tech.ChEMBL_144180 (CHEMBL749561)
Ki 250±n/a nM
Citation Gohlke, HGündisch, DSchwarz, SSeitz, GTilotta, MCWegge, T Synthesis and nicotinic binding studies on enantiopure diazine analogues of the novel (2-chloro-5-pyridyl)-9-azabicyclo[4.2.1]non-2-ene UB-165. J Med Chem45:1064-72 (2002) Neuronal acetylcholine receptor subunit alpha-7
Name:Neuronal acetylcholine receptor subunit alpha-7
Type:Enzyme
Mol. Mass.:56502.44
Organism:Rattus norvegicus (Rat)
Description:Q05941
Residue:502
BDBM50110263
NameBDBM50110263
Synonyms:2-Pyrazin-2-yl-9-aza-bicyclo[4.2.1]non-2-ene | CHEMBL10863
TypeSmall organic molecule
Emp. Form.C12H15N3
Mol. Mass.201.2676
SMILESC1CC2N[C@H]1CCC=C2c1cnccn1