Reaction Details
TargetSerine/threonine-protein phosphatase 2A 55 kDa regulatory subunit B
LigandBDBM50110686
Substrate/Competitorn/a
Meas. Tech.ChEMBL_198010 (CHEMBL799062)
IC50 0.03±n/a nM
Citation McCluskey, ASim, ATSakoff, JA Serine-threonine protein phosphatase inhibitors: development of potential therapeutic strategies. J Med Chem45:1151-75 (2002) Serine/threonine-protein phosphatase 2A 55 kDa regulatory subunit B
Name:Serine/threonine-protein phosphatase 2A 55 kDa regulatory subunit B
Synonyms:Serine-threonine protein phosphatase 2A regulatory subunit
Type:PROTEIN
Mol. Mass.:49694.81
Organism:Gallus gallus
Description:ChEMBL_161937
Residue:426
BDBM50110686
NameBDBM50110686
TypeSmall organic molecule
Emp. Form.C41H58N4O10
Mol. Mass.766.92
SMILESCO[C@@H](Cc1ccccc1)[C@@H](C)\C=C(/C)\C=C\[C@@H]1NC(=O)[C@@H](NC(=O)[C@@H](C)[C@@H](CC(=O)C(=CC)N(C)C(=O)CC[C@@H](NC(=O)[C@H]1C)C(O)=O)C(O)=O)C(C)C