Reaction Details
TargetSerine/threonine-protein phosphatase 2A 55 kDa regulatory subunit B
LigandBDBM50366883
Substrate/Competitorn/a
Meas. Tech.ChEMBL_198010 (CHEMBL799062)
IC50 0.7±n/a nM
Citation McCluskey, ASim, ATSakoff, JA Serine-threonine protein phosphatase inhibitors: development of potential therapeutic strategies. J Med Chem45:1151-75 (2002) Serine/threonine-protein phosphatase 2A 55 kDa regulatory subunit B
Name:Serine/threonine-protein phosphatase 2A 55 kDa regulatory subunit B
Synonyms:Serine-threonine protein phosphatase 2A regulatory subunit
Type:PROTEIN
Mol. Mass.:49694.81
Organism:Gallus gallus
Description:ChEMBL_161937
Residue:426
BDBM50366883
NameBDBM50366883
Synonyms:TAUTOMYCIN
TypeSmall organic molecule
Emp. Form.C41H66O13
Mol. Mass.766.9549
SMILESCO[C@H]([C@H](O)CC(=O)[C@@H](C)[C@@H](O)CC[C@@H](C)[C@@H]1O[C@]2(CC[C@@H](C)[C@H](CC[C@H](C)C(C)=O)O2)CC[C@@H]1C)[C@H](OC(=O)C[C@@H](O)C1=C(C)C(=O)OC1=O)C(C)C