Reaction Details
TargetSerine/threonine-protein phosphatase 2A 55 kDa regulatory subunit B
LigandBDBM50110700
Substrate/Competitorn/a
Meas. Tech.ChEMBL_198013 (CHEMBL799065)
IC50 1.5±n/a nM
Citation McCluskey, ASim, ATSakoff, JA Serine-threonine protein phosphatase inhibitors: development of potential therapeutic strategies. J Med Chem45:1151-75 (2002) Serine/threonine-protein phosphatase 2A 55 kDa regulatory subunit B
Name:Serine/threonine-protein phosphatase 2A 55 kDa regulatory subunit B
Synonyms:Serine-threonine protein phosphatase 2A regulatory subunit
Type:PROTEIN
Mol. Mass.:49694.81
Organism:Gallus gallus
Description:ChEMBL_161937
Residue:426
BDBM50110700
NameBDBM50110700
TypeSmall organic molecule
Emp. Form.C51H76N6O12
Mol. Mass.965.1821
SMILESCO[C@@H](Cc1ccccc1)[C@@H](C)\C=C(/C)\C=C\[C@@H]1NC(=O)[C@H](C)NC(=O)[C@@H](C)[C@@H](CC(=O)[C@H](CC(C)C)NC(=O)[C@@H](C)NC(=O)CN(C2CCCCC2)C(=O)CC[C@@H](NC(=O)[C@H]1C)C(O)=O)C(O)=O