Reaction Details
TargetAmine oxidase [flavin-containing] B
LigandBDBM50110715
Substrate/Competitorn/a
Meas. Tech.ChEMBL_123738 (CHEMBL728381)
Ki 220±n/a nM
Citation Mai, AArtico, MEsposito, MSbardella, GMassa, SBefani, OTurini, PGiovannini, VMondovì, B 3-(1H-Pyrrol-1-yl)-2-oxazolidinones as reversible, highly potent, and selective inhibitors of monoamine oxidase type A. J Med Chem45:1180-3 (2002) Amine oxidase [flavin-containing] B
Name:Amine oxidase [flavin-containing] B
Type:PROTEIN
Mol. Mass.:58428.94
Organism:Bos taurus
Description:ChEMBL_1501478
Residue:520
BDBM50110715
NameBDBM50110715
Synonyms:5-Methoxymethyl-3-[4-(4,4,4-trifluoro-3-hydroxy-butoxy)-phenyl]-oxazolidin-2-one | CHEMBL18101
TypeSmall organic molecule
Emp. Form.C15H18F3NO5
Mol. Mass.349.3023
SMILESCOC[C@@H]1CN(C(=O)O1)c1ccc(OCC[C@H](O)C(F)(F)F)cc1