Reaction Details
TargetAmine oxidase [flavin-containing] A
LigandBDBM50110718
Substrate/Competitorn/a
Meas. Tech.ChEMBL_122778 (CHEMBL879391)
Ki 40000±n/a nM
Citation Mai, AArtico, MEsposito, MSbardella, GMassa, SBefani, OTurini, PGiovannini, VMondovì, B 3-(1H-Pyrrol-1-yl)-2-oxazolidinones as reversible, highly potent, and selective inhibitors of monoamine oxidase type A. J Med Chem45:1180-3 (2002) Amine oxidase [flavin-containing] A
Name:Amine oxidase [flavin-containing] A
Type:PROTEIN
Mol. Mass.:59764.63
Organism:Bos taurus
Description:ChEMBL_1501477
Residue:527
BDBM50110718
NameBDBM50110718
Synonyms:5-Dimethylaminomethyl-3-pyrrol-1-yl-oxazolidin-2-one | CHEMBL274947
TypeSmall organic molecule
Emp. Form.C10H15N3O2
Mol. Mass.209.245
SMILESCN(C)C[C@H]1CN(C(=O)O1)n1cccc1