Reaction Details
TargetAmine oxidase [flavin-containing] A
LigandBDBM50370193
Substrate/Competitorn/a
Meas. Tech.ChEMBL_122778 (CHEMBL879391)
Ki 270±n/a nM
Citation Mai, AArtico, MEsposito, MSbardella, GMassa, SBefani, OTurini, PGiovannini, VMondovì, B 3-(1H-Pyrrol-1-yl)-2-oxazolidinones as reversible, highly potent, and selective inhibitors of monoamine oxidase type A. J Med Chem45:1180-3 (2002) Amine oxidase [flavin-containing] A
Name:Amine oxidase [flavin-containing] A
Type:PROTEIN
Mol. Mass.:59764.63
Organism:Bos taurus
Description:ChEMBL_1501477
Residue:527
BDBM50370193
NameBDBM50370193
Synonyms:CHEMBL1794849
TypeSmall organic molecule
Emp. Form.C8H10N2O3
Mol. Mass.182.1766
SMILESOC[C@H]1CN(C(=O)O1)n1cccc1