Reaction Details
TargetCarbonic anhydrase 2
LigandBDBM50097288
Substrate/Competitorn/a
Meas. Tech.ChEMBL_45044 (CHEMBL658042)
Ki 0.6±n/a nM
Citation Scozzafava, AMenabuoni, LMincione, FSupuran, CT Carbonic anhydrase inhibitors. A general approach for the preparation of water-soluble sulfonamides incorporating polyamino-polycarboxylate tails and of their metal complexes possessing long-lasting, topical intraocular pressure-lowering properties. J Med Chem45:1466-76 (2002) Carbonic anhydrase 2
Name:Carbonic anhydrase 2
Type:Enzyme
Mol. Mass.:29250.71
Organism:Homo sapiens (Human)
Description:P00918
Residue:260
BDBM50097288
NameBDBM50097288
Synonyms:((2-{Carboxymethyl-[2-(carboxymethyl-{[2-(5-sulfamoyl-[1,3,4]thiadiazol-2-ylcarbamoyl)-ethylcarbamoyl]-methyl}-amino)-ethyl]-amino}-ethyl)-{[2-(5-sulfamoyl-[1,3,4]thiadiazol-2-ylcarbamoyl)-ethylcarbamoyl]-methyl}-amino)-acetic acid | CHEMBL285516
TypeSmall organic molecule
Emp. Form.C24H37N13O14S4
Mol. Mass.859.889
SMILESNS(=O)(=O)c1nnc(NC(=O)CCNC(=O)CN(CCN(CCN(CC(O)=O)CC(=O)NCCC(=O)Nc2nnc(s2)S(N)(=O)=O)CC(O)=O)CC(O)=O)s1