Reaction Details
TargetCarbonic anhydrase 1
LigandBDBM50228328
Substrate/Competitorn/a
Meas. Tech.ChEMBL_47497 (CHEMBL662724)
Ki 39±n/a nM
Citation Scozzafava, AMenabuoni, LMincione, FSupuran, CT Carbonic anhydrase inhibitors. A general approach for the preparation of water-soluble sulfonamides incorporating polyamino-polycarboxylate tails and of their metal complexes possessing long-lasting, topical intraocular pressure-lowering properties. J Med Chem45:1466-76 (2002) Carbonic anhydrase 1
Name:Carbonic anhydrase 1
Type:Enzyme
Mol. Mass.:28873.37
Organism:Homo sapiens (Human)
Description:P00915
Residue:261
BDBM50228328
NameBDBM50228328
Synonyms:([2-(Carboxymethyl-{[2-(4-sulfamoyl-phenyl)-ethylcarbamoyl]-methyl}-amino)-ethyl]-{[2-(4-sulfamoyl-phenyl)-ethylcarbamoyl]-methyl}-amino)-acetic acid; compound with Zn complex CHEMBL1795054 | CHEMBL34526
TypeSmall organic molecule
Emp. Form.C26H36N6O10S2
Mol. Mass.656.728
SMILESNS(=O)(=O)c1ccc(CCNC(=O)CN(CCN(CC(O)=O)CC(=O)NCCc2ccc(cc2)S(N)(=O)=O)CC(O)=O)cc1