Reaction Details
TargetCarbonic anhydrase 2
LigandBDBM50097276
Substrate/Competitorn/a
Meas. Tech.ChEMBL_45044 (CHEMBL658042)
Ki 19±n/a nM
Citation Scozzafava, AMenabuoni, LMincione, FSupuran, CT Carbonic anhydrase inhibitors. A general approach for the preparation of water-soluble sulfonamides incorporating polyamino-polycarboxylate tails and of their metal complexes possessing long-lasting, topical intraocular pressure-lowering properties. J Med Chem45:1466-76 (2002) Carbonic anhydrase 2
Name:Carbonic anhydrase 2
Type:Enzyme
Mol. Mass.:29250.71
Organism:Homo sapiens (Human)
Description:P00918
Residue:260
BDBM50097276
NameBDBM50097276
Synonyms:CHEMBL286449 {{2-[Carboxymethyl-(2-{carboxymethyl-[(4-sulfamoyl-benzylcarbamoyl)-methyl]-amino}-ethyl)-amino]-ethyl}-[(4-sulfamoyl-benzylcarbamoyl)-methyl]-amino}-acetic acid; compound with Zn complex | {{2-[carboxymethyl-(2-{carboxymethyl-[(4-sulfamoyl-benzylcarbamoyl)-methyl]-amino}-ethyl)-amino]-ethyl}-[(4-sulfamoyl-benzylcarbamoyl)-methyl]-amino}-acetic acid
TypeSmall organic molecule
Emp. Form.C28H39N7O12S2
Mol. Mass.729.779
SMILESNS(=O)(=O)c1ccc(CNC(=O)CN(CCN(CCN(CC(O)=O)CC(=O)NCc2ccc(cc2)S(N)(=O)=O)CC(O)=O)CC(O)=O)cc1