Reaction Details
TargetCarbonic anhydrase 4
LigandBDBM50292077
Substrate/Competitorn/a
Meas. Tech.ChEMBL_45265 (CHEMBL658217)
Ki 5±n/a nM
Citation Scozzafava, AMenabuoni, LMincione, FSupuran, CT Carbonic anhydrase inhibitors. A general approach for the preparation of water-soluble sulfonamides incorporating polyamino-polycarboxylate tails and of their metal complexes possessing long-lasting, topical intraocular pressure-lowering properties. J Med Chem45:1466-76 (2002) Carbonic anhydrase 4
Name:Carbonic anhydrase 4
Type:Enzyme
Mol. Mass.:35152.74
Organism:Bos taurus (bovine)
Description:Bovine isozyme, isolated from lung microsomes
Residue:312
BDBM50292077
NameBDBM50292077
Synonyms:CHEMBL33478 | [[2-(2-{2-[Carboxymethyl-(2-sulfamoyl-benzothiazol-6-yloxycarbonylmethyl)-amino]-ethoxy}-ethoxy)-ethyl]-(2-sulfamoyl-benzothiazol-6-yloxycarbonylmethyl)-amino]-acetic acid
TypeSmall organic molecule
Emp. Form.C28H32N6O14S4
Mol. Mass.804.845
SMILESNS(=O)(=O)c1nc2ccc(OC(=O)CN(CCOCCOCCN(CC(O)=O)CC(=O)Oc3ccc4nc(sc4c3)S(N)(=O)=O)CC(O)=O)cc2s1