Reaction Details
TargetCarbonic anhydrase 2
LigandBDBM50097293
Substrate/Competitorn/a
Meas. Tech.ChEMBL_45044 (CHEMBL658042)
Ki 0.6±n/a nM
Citation Scozzafava, AMenabuoni, LMincione, FSupuran, CT Carbonic anhydrase inhibitors. A general approach for the preparation of water-soluble sulfonamides incorporating polyamino-polycarboxylate tails and of their metal complexes possessing long-lasting, topical intraocular pressure-lowering properties. J Med Chem45:1466-76 (2002) Carbonic anhydrase 2
Name:Carbonic anhydrase 2
Type:Enzyme
Mol. Mass.:29250.71
Organism:Homo sapiens (Human)
Description:P00918
Residue:260
BDBM50097293
NameBDBM50097293
Synonyms:CHEMBL34852 | {(2-{[2-(Bis-carboxymethyl-amino)-ethyl]-carboxymethyl-amino}-ethyl)-[2-(2-sulfamoyl-benzothiazol-6-yloxy)-ethoxycarbonylmethyl]-amino}-acetic acid
TypeSmall organic molecule
Emp. Form.C23H31N5O13S2
Mol. Mass.649.648
SMILESNS(=O)(=O)c1nc2ccc(OCCOC(=O)CN(CCN(CCN(CC(O)=O)CC(O)=O)CC(O)=O)CC(O)=O)cc2s1