Reaction Details
TargetCarbonic anhydrase 2
LigandBDBM10884
Substrate/Competitorn/a
Meas. Tech.ChEMBL_45044 (CHEMBL658042)
Ki 9±n/a nM
Citation Scozzafava, AMenabuoni, LMincione, FSupuran, CT Carbonic anhydrase inhibitors. A general approach for the preparation of water-soluble sulfonamides incorporating polyamino-polycarboxylate tails and of their metal complexes possessing long-lasting, topical intraocular pressure-lowering properties. J Med Chem45:1466-76 (2002) Carbonic anhydrase 2
Name:Carbonic anhydrase 2
Type:Enzyme
Mol. Mass.:29250.71
Organism:Homo sapiens (Human)
Description:P00918
Residue:260
BDBM10884
NameBDBM10884
Synonyms:(2S,4S)-4-(ethylamino)-2-methyl-1,1-dioxo-2H,3H,4H-1,7-thieno[2,3-b]thiopyran-6-sulfonamide Dorzolamide (DZA)
TypeSmall organic molecule
Emp. Form.C10H16N2O4S3
Mol. Mass.324.44
SMILESCCN[C@H]1C[C@H](C)S(=O)(=O)c2sc(cc12)S(N)(=O)=O