Reaction Details
TargetNitric oxide synthase, inducible
LigandBDBM50111438
Substrate/Competitorn/a
Meas. Tech.ChEMBL_89209 (CHEMBL702446)
Ki 2.2±n/a nM
Citation Toogood, PL Inhibition of protein-protein association by small molecules: approaches and progress. J Med Chem45:1543-58 (2002) Nitric oxide synthase, inducible
Name:Nitric oxide synthase, inducible
Type:Homodimer
Mol. Mass.:131141.95
Organism:Homo sapiens (Human)
Description:P35228
Residue:1153
BDBM50111438
NameBDBM50111438
Synonyms:3-{[(Benzo[1,3]dioxol-5-ylmethyl)-carbamoyl]-methyl}-4-(2-imidazol-1-yl-pyrimidin-4-yl)-piperazine-1-carboxylic acid methyl ester N-[(1,3-benzodioxol-5-yl)methyl]-1-[2-(1H-imidazol-1-yl)pyrimidin-4-yl]-4-[(methoxy)carbonyl]-2-piperazineacetamide
TypeSmall organic molecule
Emp. Form.C23H25N7O5
Mol. Mass.479.4885
SMILESCOC(=O)N1CCN(C(CC(=O)NCc2ccc3OCOc3c2)C1)c1ccnc(n1)-n1ccnc1