Reaction Details
TargetGrowth factor receptor-bound protein 2
LigandBDBM50111441
Substrate/Competitorn/a
Meas. Tech.ChEMBL_72359 (CHEMBL686446)
IC50 50±n/a nM
Citation Toogood, PL Inhibition of protein-protein association by small molecules: approaches and progress. J Med Chem45:1543-58 (2002) Growth factor receptor-bound protein 2
Name:Growth factor receptor-bound protein 2
Type:Protein
Mol. Mass.:25205.04
Organism:Homo sapiens (Human)
Description:P62993
Residue:217
BDBM50111441
NameBDBM50111441
Synonyms:CHEMBL288116 | [1-[1-(6-Carbamoyl-cyclohex-2-enylcarbamoyl)-cyclohexylcarbamoyl]-2-(4-phosphonooxy-phenyl)-ethyl]-carbamic acid 3-amino-benzyl ester
TypeSmall organic molecule
Emp. Form.C38H43N5O11
Mol. Mass.745.7749
SMILESNC(=O)C[C@H](NC(=O)C1(CCCCC1)NC(=O)[C@H](Cc1ccc(cc1)C(C(O)=O)C(O)=O)NC(=O)C(O)=O)C(=O)NCCCc1ccc2ccccc2c1