Reaction Details
TargetHigh affinity nerve growth factor receptor
LigandBDBM50111443
Substrate/Competitorn/a
Meas. Tech.ChEMBL_211953 (CHEMBL816543)
IC50 3720±n/a nM
Citation Toogood, PL Inhibition of protein-protein association by small molecules: approaches and progress. J Med Chem45:1543-58 (2002) High affinity nerve growth factor receptor
Name:High affinity nerve growth factor receptor
Type:n/a
Mol. Mass.:87498.18
Organism:Homo sapiens (Human)
Description:P04629
Residue:796
BDBM50111443
NameBDBM50111443
Synonyms:2-(2-Hydroxy-ethylamino)-5-nitro-benzo[de]isoquinoline-1,3-dione(ALE-0540) | CHEMBL440470
TypeSmall organic molecule
Emp. Form.C14H11N3O5
Mol. Mass.301.2542
SMILESOCCNN1C(=O)c2cccc3cc(cc(C1=O)c23)[N+]([O-])=O