Reaction Details
TargetChymotrypsin-C
LigandBDBM50065297
Substrate/Competitorn/a
Meas. Tech.ChEMBL_49925 (CHEMBL664294)
IC50 30000±n/a nM
Citation McGovern, SLCaselli, EGrigorieff, NShoichet, BK A common mechanism underlying promiscuous inhibitors from virtual and high-throughput screening. J Med Chem45:1712-22 (2002) Chymotrypsin-C
Name:Chymotrypsin-C
Type:Enzyme
Mol. Mass.:29487.98
Organism:Homo sapiens (Human)
Description:Q99895
Residue:268
BDBM50065297
NameBDBM50065297
Synonyms:3-(4-Isopropyl-benzylidene)-1,3-dihydro-indol-2-one CHEMBL48760
TypeSmall organic molecule
Emp. Form.C18H17NO
Mol. Mass.263.3337
SMILESCC(C)c1ccc(\C=C2\C(=O)Nc3ccccc23)cc1