Reaction Details
TargetChymotrypsin-C
LigandBDBM50079267
Substrate/Competitorn/a
Meas. Tech.ChEMBL_49925 (CHEMBL664294)
IC50 40000±n/a nM
Citation McGovern, SLCaselli, EGrigorieff, NShoichet, BK A common mechanism underlying promiscuous inhibitors from virtual and high-throughput screening. J Med Chem45:1712-22 (2002) Chymotrypsin-C
Name:Chymotrypsin-C
Type:Enzyme
Mol. Mass.:29487.98
Organism:Homo sapiens (Human)
Description:Q99895
Residue:268
BDBM50079267
NameBDBM50079267
Synonyms:Congo Red Kongorot disodium 3,3'-((1,1'-biphenyl)-4,4'-diylbis(azo))bis(4-aminonaphthalene-1-sulphonate) | disodium 3,3'-(biphenyl-4,4'-diyldidiazene-2,1-diyl)bis(4-aminonaphthalene-1-sulfonate)
TypeSmall organic molecule
Emp. Form.C32H22N6O6S2
Mol. Mass.650.685
SMILESNc1c(cc(c2ccccc12)S([O-])(=O)=O)\N=N\c1ccc(cc1)-c1ccc(cc1)\N=N\c1cc(c2ccccc2c1N)S([O-])(=O)=O