Reaction Details
TargetDihydrofolate reductase
LigandBDBM50079267
Substrate/Competitorn/a
Meas. Tech.ChEMBL_53613 (CHEMBL661843)
IC50 400±n/a nM
Citation McGovern, SLCaselli, EGrigorieff, NShoichet, BK A common mechanism underlying promiscuous inhibitors from virtual and high-throughput screening. J Med Chem45:1712-22 (2002) Dihydrofolate reductase
Name:Dihydrofolate reductase
Type:n/a
Mol. Mass.:21652.69
Organism:Gallus gallus (Chicken)
Description:n/a
Residue:189
BDBM50079267
NameBDBM50079267
Synonyms:Congo Red Kongorot disodium 3,3'-((1,1'-biphenyl)-4,4'-diylbis(azo))bis(4-aminonaphthalene-1-sulphonate) | disodium 3,3'-(biphenyl-4,4'-diyldidiazene-2,1-diyl)bis(4-aminonaphthalene-1-sulfonate)
TypeSmall organic molecule
Emp. Form.C32H22N6O6S2
Mol. Mass.650.685
SMILESNc1c(cc(c2ccccc12)S([O-])(=O)=O)\N=N\c1ccc(cc1)-c1ccc(cc1)\N=N\c1cc(c2ccccc2c1N)S([O-])(=O)=O