Reaction Details
TargetCholinesterase
LigandBDBM50122491
Substrate/Competitorn/a
Meas. Tech.ChEMBL_41269 (CHEMBL655026)
Ki 10±n/a nM
Citation Savini, LGaeta, AFattorusso, CCatalanotti, BCampiani, GChiasserini, LPellerano, CNovellino, EMcKissic, DSaxena, A Specific targeting of acetylcholinesterase and butyrylcholinesterase recognition sites. Rational design of novel, selective, and highly potent cholinesterase inhibitors. J Med Chem46:1-4 (2002) 
 
Cholinesterase
Name:Cholinesterase
Type:Homotetramer
Mol. Mass.:68422.27
Organism:Homo sapiens (Human)
Description:P06276
Residue:602
BDBM50122491
NameBDBM50122491
Synonyms:(1,2,3,4-Tetrahydro-acridin-9-yl)-[5-(1,2,3,4-tetrahydro-acridin-9-ylsulfanyl)-pentyl]-amine | CHEMBL129719
TypeSmall organic molecule
Emp. Form.C31H35N3S
Mol. Mass.481.695
SMILESC(CCNc1c2CCCCc2nc2ccccc12)CCSc1c2CCCCc2nc2ccccc12