Reaction Details
TargetAcetylcholinesterase
LigandBDBM8970
Substrate/Competitorn/a
Meas. Tech.ChEMBL_27955 (CHEMBL649135)
Ki 340±n/a nM
Citation Savini, LGaeta, AFattorusso, CCatalanotti, BCampiani, GChiasserini, LPellerano, CNovellino, EMcKissic, DSaxena, A Specific targeting of acetylcholinesterase and butyrylcholinesterase recognition sites. Rational design of novel, selective, and highly potent cholinesterase inhibitors. J Med Chem46:1-4 (2002) 
 
Acetylcholinesterase
Name:Acetylcholinesterase
Type:Enzyme
Mol. Mass.:67659.62
Organism:Bos taurus (bovine)
Description:n/a
Residue:613
BDBM8970
NameBDBM8970
Synonyms:CHEMBL51197 Tacrine Dimer 4f | tacrine heterobivalent compound 3e
TypeSmall organic molecule
Emp. Form.C33H39N3S
Mol. Mass.509.748
SMILESC(CCCNc1c2CCCCc2nc2ccccc12)CCCSc1c2CCCCc2nc2ccccc12