Reaction Details
TargetAcetylcholinesterase
LigandBDBM8965
Substrate/Competitorn/a
Meas. Tech.ChEMBL_27955 (CHEMBL649135)
Ki 0.06±n/a nM
Citation Savini, LGaeta, AFattorusso, CCatalanotti, BCampiani, GChiasserini, LPellerano, CNovellino, EMcKissic, DSaxena, A Specific targeting of acetylcholinesterase and butyrylcholinesterase recognition sites. Rational design of novel, selective, and highly potent cholinesterase inhibitors. J Med Chem46:1-4 (2002) 
 
Acetylcholinesterase
Name:Acetylcholinesterase
Type:Enzyme
Mol. Mass.:67659.62
Organism:Bos taurus (bovine)
Description:n/a
Residue:613
BDBM8965
NameBDBM8965
Synonyms:CHEMBL338755 methylbis[3-(1,2,3,4-tetrahydroacridin-9-ylamino)propyl]amine
TypeSmall organic molecule
Emp. Form.C33H41N5
Mol. Mass.507.7121
SMILESCN(CCCNc1c2CCCCc2nc2ccccc12)CCCNc1c2CCCCc2nc2ccccc12